BDBM50059884 CHEMBL3394257
SMILES CCCN(CCCNC(=O)CCCNC(=O)CCCOc1ccc(CCNc2nc(N)n3nc(nc3n2)-c2ccco2)cc1)CCc1cccc2NC(=O)Cc12
InChI Key InChIKey=QXKURYVTBSPJPI-UHFFFAOYSA-N
Data  2 IC50  2 EC50
  Tab Delimited (TSV)   2D SDfile   Computed 3D by Vconf -m prep SDfile
Find this compound or compounds like it in BindingDB:
Activity Spreadsheet -- Enzyme Inhibition Constant Data from BindingDB
Found 4 hits for monomerid = 50059884
TargetD(2) dopamine receptor(Homo sapiens (Human))
Monash University (Parkville Campus)
Curated by ChEMBL
LigandPNGBDBM50059884(CHEMBL3394257)
Affinity DataEC50:  776nM. Assay description: Agonist activity at human dopamine D2L receptor expressed in CHO cell membranes incubated for 1 hr by [35S]GTPgammaS binding assay
In DepthDetails ArticlePubMed
TargetD(2) dopamine receptor(Homo sapiens (Human))
Monash University (Parkville Campus)
Curated by ChEMBL
LigandPNGBDBM50059884(CHEMBL3394257)
Affinity DataEC50:  785nM. Assay description: Agonist activity at human dopamine D2L receptor expressed in CHO cell membranes incubated for 1 hr by [35S]GTPgammaS binding assay
In DepthDetails ArticlePubMed
TargetAdenosine receptor A2a(Homo sapiens (Human))
Monash University (Parkville Campus)
Curated by ChEMBL
LigandPNGBDBM50059884(CHEMBL3394257)
Affinity DataIC50:  110nM. Assay description: Inhibition of human adenosine A2A receptor expressed in FlpIn-CHO cells assessed as inhibition of NECA-induced cAMP accumulation incubated for 30 min...
In DepthDetails ArticlePubMed
TargetAdenosine receptor A2a(Homo sapiens (Human))
Monash University (Parkville Campus)
Curated by ChEMBL
LigandPNGBDBM50059884(CHEMBL3394257)
Affinity DataIC50:  110nM. Assay description: Inhibition of human adenosine A2A receptor expressed in FlpIn-CHO cells assessed as inhibition of NECA-induced cAMP accumulation incubated for 30 min...
In DepthDetails ArticlePubMed