BDBM50062672 2-Chloro-4-trifluoromethyl-pyrimidine-5-carboxylic acid (3,5-dimethoxy-phenyl)-amide::CHEMBL131789
SMILES COc1cc(NC(=O)c2cnc(Cl)nc2C(F)(F)F)cc(OC)c1
InChI Key InChIKey=DXYNQZPOUWZUED-UHFFFAOYSA-N
Data  2 IC50
  Tab Delimited (TSV)   2D SDfile   Computed 3D by Vconf -m prep SDfile
Find this compound or compounds like it in BindingDB:
Activity Spreadsheet -- Enzyme Inhibition Constant Data from BindingDB
Found 2 hits for monomerid = 50062672
TargetNuclear factor NF-kappa-B p105 subunit(Homo sapiens (Human))
Signal Pharmaceuticals
Curated by ChEMBL
LigandPNGBDBM50062672(2-Chloro-4-trifluoromethyl-pyrimidine-5-carboxylic...)
Affinity DataIC50:  1.20E+3nM. Assay description: In vitro inhibitory activity against human Jurkat T-Cells stably transfected with an Nuclear factor kappa B transcription factor
In DepthDetails ArticlePubMed
TargetCyclic AMP-dependent transcription factor ATF-1(Homo sapiens (Human))
Signal Pharmaceuticals
Curated by ChEMBL
LigandPNGBDBM50062672(2-Chloro-4-trifluoromethyl-pyrimidine-5-carboxylic...)
Affinity DataIC50:  1.60E+3nM. Assay description: In vitro inhibitory activity against human Jurkat T-Cells stably transfected with activating transcription factor 1
In DepthDetails ArticlePubMed