BDBM50065929 CHEMBL99229::N-Acetoxy-N-phenyl-benzenesulfonamide
SMILES CC(=O)ON(c1ccccc1)S(=O)(=O)c1ccccc1
InChI Key InChIKey=ZSODTYACKGCZAG-UHFFFAOYSA-N
Data  1 IC50
  Tab Delimited (TSV)   2D SDfile   Computed 3D by Vconf -m prep SDfile
Find this compound or compounds like it in BindingDB:
Activity Spreadsheet -- Enzyme Inhibition Constant Data from BindingDB
Found 1 hit for monomerid = 50065929
TargetAldehyde dehydrogenase 1A1(Rattus norvegicus)
St. Cloud State University
Curated by ChEMBL
LigandPNGBDBM50065929(CHEMBL99229 | N-Acetoxy-N-phenyl-benzenesulfonamid...)
Affinity DataIC50:  3.60E+4nM. Assay description: Inhibitory activity of the compound against yeast aldehyde dehydrogenase(AIDH)
In DepthDetails ArticlePubMed