BDBM50065933 CHEMBL420451::N-Hydroxy-N-phenyl-benzenesulfonamide
SMILES ON(c1ccccc1)S(=O)(=O)c1ccccc1
InChI Key InChIKey=GIRGWRZFFZOIBR-UHFFFAOYSA-N
Data  1 IC50
  Tab Delimited (TSV)   2D SDfile   Computed 3D by Vconf -m prep SDfile
Find this compound or compounds like it in BindingDB:
Activity Spreadsheet -- Enzyme Inhibition Constant Data from BindingDB
Found 1 hit for monomerid = 50065933
TargetAldehyde dehydrogenase 1A1(Rattus norvegicus)
St. Cloud State University
Curated by ChEMBL
LigandPNGBDBM50065933(CHEMBL420451 | N-Hydroxy-N-phenyl-benzenesulfonami...)
Affinity DataIC50:  1.66E+3nM. Assay description: Inhibitory activity of the compound against yeast aldehyde dehydrogenase(AIDH)
In DepthDetails ArticlePubMed