BDBM50066919 (2R,3R,4R,5R)-2,5-Bis-benzyloxy-3,4-dihydroxy-hexanedioic acid bis-[((S)-methylcarbamoyl-phenyl-methyl)-amide]::2,5-Bis-benzyloxy-3,4-dihydroxy-hexanedioic acid bis-[(methylcarbamoyl-phenyl-methyl)-amide]::CHEMBL124093
SMILES CNC(=O)[C@@H](NC(=O)[C@H](OCc1ccccc1)[C@H](O)[C@@H](O)[C@@H](OCc1ccccc1)C(=O)N[C@H](C(=O)NC)c1ccccc1)c1ccccc1
InChI Key InChIKey=SUXVPHKLQQOPHJ-XLTUSUNSSA-N
Data  2 KI  1 Kd  1 Koff  1 Kon
  Tab Delimited (TSV)   2D SDfile   Computed 3D by Vconf -m prep SDfile
Find this compound or compounds like it in BindingDB:
Activity Spreadsheet -- Enzyme Inhibition Constant Data from BindingDB
Found 3 hits for monomerid = 50066919
TargetGag-Pol polyprotein [489-587](Human immunodeficiency virus type 1)
Uppsala University
Curated by ChEMBL
LigandPNGBDBM50066919((2R,3R,4R,5R)-2,5-Bis-benzyloxy-3,4-dihydroxy-hexa...)
Affinity DataKi:  2.30nM Kd:  27.4nM Koff:  2.05E+8s-1Assay Description:Association rate constant for the interaction between inhibitor and HIV-1 protease
In DepthDetails ArticlePubMed
TargetGag-Pol polyprotein [489-587](Human immunodeficiency virus type 1)
Uppsala University
Curated by ChEMBL
LigandPNGBDBM50066919((2R,3R,4R,5R)-2,5-Bis-benzyloxy-3,4-dihydroxy-hexa...)
Affinity DataKi:  2.30nM. Assay description: Inhibitory activity against purified HIV-1 protease expressed in E. coli in sensitive fluorometric assay
In DepthDetails ArticlePubMed
TargetGag-Pol polyprotein [489-587](Human immunodeficiency virus type 1)
Uppsala University
Curated by ChEMBL
LigandPNGBDBM50066919((2R,3R,4R,5R)-2,5-Bis-benzyloxy-3,4-dihydroxy-hexa...)
Affinity DataKon:  14M-1s-1Assay Description:Association rate constant for the interaction between inhibitor and HIV-1 protease
In DepthDetails ArticlePubMed