BDBM50068469 (2R,3R,5R)-8-Methyl-3-phenyl-2-propyl-8-aza-bicyclo[3.2.1]octane::CHEMBL345026
SMILES CCC[C@H]1C2CC[C@H](C[C@H]1c1ccccc1)N2C
InChI Key InChIKey=ZWPCJQABQGIZIQ-VPSFDDGASA-N
Data  3 KI  3 IC50
  Tab Delimited (TSV)   2D SDfile   Computed 3D by Vconf -m prep SDfile
Find this compound or compounds like it in BindingDB:
Activity Spreadsheet -- Enzyme Inhibition Constant Data from BindingDB
Found 6 hits for monomerid = 50068469
TargetSodium-dependent dopamine transporter(Rattus norvegicus (rat))
Georgetown University Medical Center
Curated by ChEMBL
LigandPNGBDBM50068469((2R,3R,5R)-8-Methyl-3-phenyl-2-propyl-8-aza-bicycl...)
Affinity DataKi:  30nM. Assay description: Binding affinity for [3H]DA (Dopamine transporter) uptake by striated synaptosomes
In DepthDetails ArticlePubMed
TargetSodium-dependent dopamine transporter(Rattus norvegicus (rat))
Georgetown University Medical Center
Curated by ChEMBL
LigandPNGBDBM50068469((2R,3R,5R)-8-Methyl-3-phenyl-2-propyl-8-aza-bicycl...)
Affinity DataKi:  75nM. Assay description: Binding affinity of compound on dopamine transporters of rat striated membranes using [3H]- mazindol.
In DepthDetails ArticlePubMed
TargetSodium-dependent serotonin transporter(Rattus norvegicus (rat))
Georgetown University Medical Center
Curated by ChEMBL
LigandPNGBDBM50068469((2R,3R,5R)-8-Methyl-3-phenyl-2-propyl-8-aza-bicycl...)
Affinity DataKi:  389nM. Assay description: Binding affinity for Serotonin transporter was determined by [3H]5-HT (serotonin) uptake by striated synaptosomes
In DepthDetails ArticlePubMed
TargetSodium-dependent dopamine transporter(Rattus norvegicus (rat))
Georgetown University Medical Center
Curated by ChEMBL
LigandPNGBDBM50068469((2R,3R,5R)-8-Methyl-3-phenyl-2-propyl-8-aza-bicycl...)
Affinity DataIC50:  33nM. Assay description: Inhibitory activity determined for [3H]DA (Dopamine transporter) uptake by striated synaptosomes
In DepthDetails ArticlePubMed
TargetSodium-dependent dopamine transporter(Rattus norvegicus (rat))
Georgetown University Medical Center
Curated by ChEMBL
LigandPNGBDBM50068469((2R,3R,5R)-8-Methyl-3-phenyl-2-propyl-8-aza-bicycl...)
Affinity DataIC50:  141nM. Assay description: Inhibitory activity on dopamine transporters of rat striated membranes using [3H]- mazindol.
In DepthDetails ArticlePubMed
TargetSodium-dependent serotonin transporter(Rattus norvegicus (rat))
Georgetown University Medical Center
Curated by ChEMBL
LigandPNGBDBM50068469((2R,3R,5R)-8-Methyl-3-phenyl-2-propyl-8-aza-bicycl...)
Affinity DataIC50:  427nM. Assay description: Inhibitory activity against Serotonin transporter was determined for [3H]5-HT (serotonin) uptake by striated synaptosomes
In DepthDetails ArticlePubMed