BDBM50068618 2-(Benzothiazol-2-ylsulfanyl)-1-(3,4-dihydroxy-phenyl)-ethanone::CHEMBL148905::cid_4066568
SMILES Oc1ccc(cc1O)C(=O)CSc1nc2ccccc2s1
InChI Key InChIKey=DBTRBCTYKUZFNI-UHFFFAOYSA-N
Data  1 KI  2 IC50
  Tab Delimited (TSV)   2D SDfile   Computed 3D by Vconf -m prep SDfile
Find this compound or compounds like it in BindingDB:
Activity Spreadsheet -- Enzyme Inhibition Constant Data from BindingDB
Found 3 hits for monomerid = 50068618
TargetGlucagon receptor(Homo sapiens (Human))
Novo Nordisk
Curated by ChEMBL
LigandPNGBDBM50068618(2-(Benzothiazol-2-ylsulfanyl)-1-(3,4-dihydroxy-phe...)
Affinity DataKi:  7.30E+4nM. Assay description: Binding affinity towards cloned human glucagon receptor in BHK cells.
In DepthDetails ArticlePubMed
TargetAlkaline phosphatase, tissue-nonspecific isozyme(Homo sapiens (Human))
Burnham Center For Chemical Genomics
Curated by PubChem BioAssay
LigandPNGBDBM50068618(2-(Benzothiazol-2-ylsulfanyl)-1-(3,4-dihydroxy-phe...)
Affinity DataIC50:  3.03E+3nM. Assay description: Sanford-Burnham Center for Chemical Genomics (SBCCG) Sanford-Burnham Medical Research Institute (SBMRI, San Diego, CA) NIH Molecular Libraries Screen...
In DepthDetails PCBioAssay
TargetAlkaline phosphatase, germ cell type(Homo sapiens (Human))
Burnham Center For Chemical Genomics
Curated by PubChem BioAssay
LigandPNGBDBM50068618(2-(Benzothiazol-2-ylsulfanyl)-1-(3,4-dihydroxy-phe...)
Affinity DataIC50:  3.42E+3nM. Assay description: Data Source: Sanford-Burnham Center for Chemical Genomics (SBCCG) Source Affiliation: Sanford-Burnham Medical Research Institute (SBMRI, San Diego, C...
In DepthDetails PCBioAssay