BDBM50068785 6-(Thiazol-5-ylmethoxy)-6,9-dihydro-1H-purin-2-ylamine::CHEMBL345550
SMILES NC1=Nc2nc[nH]c2C(N1)OCc1cncs1
InChI Key InChIKey=CRMDWHGQCMALDE-UHFFFAOYSA-N
Data  2 IC50
  Tab Delimited (TSV)   2D SDfile   Computed 3D by Vconf -m prep SDfile
Find this compound or compounds like it in BindingDB:
Activity Spreadsheet -- Enzyme Inhibition Constant Data from BindingDB
Found 2 hits for monomerid = 50068785
TargetMethylated-DNA--protein-cysteine methyltransferase(Homo sapiens (Human))
Trinity College
Curated by ChEMBL
LigandPNGBDBM50068785(6-(Thiazol-5-ylmethoxy)-6,9-dihydro-1H-purin-2-yla...)
Affinity DataIC50:  33nM. Assay description: O6-Alkylguanine-DNA Alkyltransferase-Inactivating Activity (Concentration of inactivator required to produce 50% reduction in ATPase activity)
In DepthDetails ArticlePubMed
TargetMethylated-DNA--protein-cysteine methyltransferase(Homo sapiens (Human))
Trinity College
Curated by ChEMBL
LigandPNGBDBM50068785(6-(Thiazol-5-ylmethoxy)-6,9-dihydro-1H-purin-2-yla...)
Affinity DataIC50:  60nM. Assay description: O6-Alkylguanine-DNA Alkyltransferase-Inactivating Activity in Raji cells (Concentration of inactivator required to produce 50% reduction in ATPase ac...
In DepthDetails ArticlePubMed