BDBM50069012 1-(4-Fluoro-phenyl)-8,9-dimethoxy-2,2a,3,4,5,6-hexahydro-1H-azepino[3,4,5-cd]indole::CHEMBL174949
SMILES COc1cc2CCNCC3CN(c(c23)c1OC)c1ccc(F)cc1
InChI Key InChIKey=XYNLJBRCCYTMSL-UHFFFAOYSA-N
Data  4 KI
  Tab Delimited (TSV)   2D SDfile   Computed 3D by Vconf -m prep SDfile
Find this compound or compounds like it in BindingDB:
Activity Spreadsheet -- Enzyme Inhibition Constant Data from BindingDB
Found 4 hits for monomerid = 50069012
TargetSerotonin 2 (5-HT2) receptor(RAT)
R. W. Johnson Pharmaceutical Research Institute
Curated by ChEMBL
LigandPNGBDBM50069012(1-(4-Fluoro-phenyl)-8,9-dimethoxy-2,2a,3,4,5,6-hex...)
Affinity DataKi:  1nM. Assay description: Affinity for 5-hydroxytryptamine 2 receptor
In DepthDetails ArticlePubMed
TargetAlpha-1A/Alpha-1B/Alpha-1D adrenergic receptor(Rattus norvegicus (rat))
R. W. Johnson Pharmaceutical Research Institute
Curated by ChEMBL
LigandPNGBDBM50069012(1-(4-Fluoro-phenyl)-8,9-dimethoxy-2,2a,3,4,5,6-hex...)
Affinity DataKi:  57nM. Assay description: Affinity for alpha-1 adrenergic receptor
In DepthDetails ArticlePubMed
TargetD(2) dopamine receptor(Rattus norvegicus (rat))
R. W. Johnson Pharmaceutical Research Institute
Curated by ChEMBL
LigandPNGBDBM50069012(1-(4-Fluoro-phenyl)-8,9-dimethoxy-2,2a,3,4,5,6-hex...)
Affinity DataKi:  67nM. Assay description: Affinity for Dopamine receptor D2
In DepthDetails ArticlePubMed
TargetD(1A) dopamine receptor(RAT)
R. W. Johnson Pharmaceutical Research Institute
Curated by ChEMBL
LigandPNGBDBM50069012(1-(4-Fluoro-phenyl)-8,9-dimethoxy-2,2a,3,4,5,6-hex...)
Affinity DataKi:  88nM. Assay description: Affinity for Dopamine receptor D1
In DepthDetails ArticlePubMed