BDBM50069616 (2R,3S)-N*1*-Hydroxy-2-{2-[(E)-hydroxyimino]-2-phenyl-ethylsulfanylmethyl}-3-isobutyl-N*4*-((S)-1-methylcarbamoyl-2-phenyl-ethyl)-succinamide::CHEMBL115348
SMILES CNC(=O)[C@H](Cc1ccccc1)NC(=O)[C@H](CC(C)C)[C@H](CSCC(N=O)c1ccccc1)C(=O)NO
InChI Key InChIKey=OEPQSXYFAMUFLS-XDXUOVRZSA-N
Data  1 IC50
  Tab Delimited (TSV)   2D SDfile   Computed 3D by Vconf -m prep SDfile
Find this compound or compounds like it in BindingDB:
Activity Spreadsheet -- Enzyme Inhibition Constant Data from BindingDB
Found 1 hit for monomerid = 50069616
TargetLow affinity immunoglobulin epsilon Fc receptor(Homo sapiens (Human))
Smithkline Beecham Pharmaceuticals
Curated by ChEMBL
LigandPNGBDBM50069616((2R,3S)-N*1*-Hydroxy-2-{2-[(E)-hydroxyimino]-2-phe...)
Affinity DataIC50:  12nM. Assay description: Inhibition against CD23 (IgE receptor) proteolysis in membranes derived from RPM18866 cells
In DepthDetails ArticlePubMed