BDBM50069619 4-[(2S,3R)-2-Hydroxycarbamoyl-5-methyl-3-((S)-1-methylcarbamoyl-2-phenyl-ethylcarbamoyl)-hexylsulfanyl]-benzoic acid methyl ester::CHEMBL320799
SMILES CNC(=O)[C@H](Cc1ccccc1)NC(=O)[C@H](CC(C)C)[C@H](CSc1ccc(cc1)C(=O)OC)C(=O)NO
InChI Key InChIKey=ARYCNDSONFIACT-VJBWXMMDSA-N
Data  1 IC50
  Tab Delimited (TSV)   2D SDfile   Computed 3D by Vconf -m prep SDfile
Find this compound or compounds like it in BindingDB:
Activity Spreadsheet -- Enzyme Inhibition Constant Data from BindingDB
Found 1 hit for monomerid = 50069619
TargetLow affinity immunoglobulin epsilon Fc receptor(Homo sapiens (Human))
Smithkline Beecham Pharmaceuticals
Curated by ChEMBL
LigandPNGBDBM50069619(4-[(2S,3R)-2-Hydroxycarbamoyl-5-methyl-3-((S)-1-me...)
Affinity DataIC50:  50nM. Assay description: Tested for inhibition against CD23 (IgE receptor) proteolysis in membranes derived from RPM18866 cells ( a human B-cell line); value ranges from 50-1...
In DepthDetails ArticlePubMed