BDBM50072131 CHEMBL3407914
SMILES Cc1ccc(cc1F)-c1cc(ncn1)C(O)=O
InChI Key InChIKey=FMYASDAPHJQSDM-UHFFFAOYSA-N
Data  2 IC50
  Tab Delimited (TSV)   2D SDfile   Computed 3D by Vconf -m prep SDfile
Find this compound or compounds like it in BindingDB:
Activity Spreadsheet -- Enzyme Inhibition Constant Data from BindingDB
Found 2 hits for monomerid = 50072131
TargetKynurenine 3-monooxygenase(Homo sapiens (Human))
Evotec (Uk)
Curated by ChEMBL
LigandPNGBDBM50072131(CHEMBL3407914)
Affinity DataIC50:  370nM. Assay description: Inhibition of human KMO transfected in CHO cells assessed as conversion of kynurenine to 3-hydroxykynurenine by LC-MS/MS analysis
In DepthDetails ArticlePubMed
TargetKynurenine 3-monooxygenase(Homo sapiens (Human))
Evotec (Uk)
Curated by ChEMBL
LigandPNGBDBM50072131(CHEMBL3407914)
Affinity DataIC50:  0.900nM. Assay description: Inhibition of human KMO assessed as conversion of kynurenine to 3-hydroxykynurenine by LC-MS/MS analysis
In DepthDetails ArticlePubMed