BDBM50072461 CHEMBL3409604
SMILES OC[C@H](c1ccc(Cl)c(F)c1)n1ccc(cc1=O)-c1ccnc(NC2CC(F)(F)C2)n1
InChI Key InChIKey=NFTQIGZYJGXIRQ-GOSISDBHSA-N
Data  1 KI
  Tab Delimited (TSV)   2D SDfile   Computed 3D by Vconf -m prep SDfile
Find this compound or compounds like it in BindingDB:
Activity Spreadsheet -- Enzyme Inhibition Constant Data from BindingDB
Found 1 hit for monomerid = 50072461
TargetMitogen-activated protein kinase 1(Homo sapiens (Human))
Array Biopharma
Curated by ChEMBL
LigandPNGBDBM50072461(CHEMBL3409604)
Affinity DataKi:  1.20nM. Assay description: Inhibition of 6-His tagged human ERK2 expressed in Escherichia coli measured over 30 mins by competition assay
In DepthDetails ArticlePubMed