BDBM50073664 CHEMBL3409226
SMILES Fc1ccc(CN=C=S)cc1
InChI Key InChIKey=LPVNPJMEWWUFHD-UHFFFAOYSA-N
Data  3 IC50
  Tab Delimited (TSV)   2D SDfile   Computed 3D by Vconf -m prep SDfile
Find this compound or compounds like it in BindingDB:
Activity Spreadsheet -- Enzyme Inhibition Constant Data from BindingDB
Found 3 hits for monomerid = 50073664
TargetMacrophage migration inhibitory factor(Homo sapiens (Human))
University Of Otago
Curated by ChEMBL
LigandPNGBDBM50073664(CHEMBL3409226)
Affinity DataIC50:  9.60E+3nM. Assay description: Inhibition of macrophage migration inhibitory factor tautomerase activity in human Jurkat T cells using L-dopachrome methyl ester as substrate incuba...
In DepthDetails ArticlePubMed
TargetMacrophage migration inhibitory factor(Homo sapiens (Human))
University Of Otago
Curated by ChEMBL
LigandPNGBDBM50073664(CHEMBL3409226)
Affinity DataIC50:  540nM. Assay description: Inhibition of macrophage migration inhibitory factor tautomerase activity in human Jurkat T cells using L-dopachrome methyl ester as substrate incuba...
In DepthDetails ArticlePubMed
TargetMacrophage migration inhibitory factor(Homo sapiens (Human))
University Of Otago
Curated by ChEMBL
LigandPNGBDBM50073664(CHEMBL3409226)
Affinity DataIC50:  3.10E+4nM. Assay description: Inhibition of human recombinant macrophage migration inhibitory factor tautomerase activity expressed in Escherichia coli DH5alpha using L-dopachrome...
In DepthDetails ArticlePubMed