BDBM50075274 1'N-[1-(5-aminopentylcarbamoyl)-2-(1H-3-indolyl)-(1R)-ethyl]-1'N-methylspiro[2,3-dihydro-1H-indene-1,4'-(hexahydropyridine)]-1'-carboxamide::CHEMBL144146
SMILES CN([C@H](Cc1c[nH]c2ccccc12)C(=O)NCCCCCN)C(=O)N1CCC2(CCc3ccccc23)CC1
InChI Key InChIKey=XKNUACAJSZCRGE-MUUNZHRXSA-N
Data  1 KI
  Tab Delimited (TSV)   2D SDfile   Computed 3D by Vconf -m prep SDfile
Find this compound or compounds like it in BindingDB:
Activity Spreadsheet -- Enzyme Inhibition Constant Data from BindingDB
Found 1 hit for monomerid = 50075274
TargetSomatostatin receptor type 2(MOUSE)
Merck Research Laboratories
Curated by ChEMBL
LigandPNGBDBM50075274(1'N-[1-(5-aminopentylcarbamoyl)-2-(1H-3-indolyl)-(...)
Affinity DataKi: >10nM. Assay description: In vitro binding affinity of the compound was evaluated against mouse Somatostatin receptor type 2 (mSSTR-2)
In DepthDetails ArticlePubMed