BDBM50075293 (R)-6-Amino-2-{(2R,3S)-3-(1H-indol-3-yl)-2-[3-(1-methyl-3-phenyl-propyl)-2-oxo-imidazolidin-1-yl]-butyrylamino}-hexanoic acid tert-butyl ester::CHEMBL343347
SMILES CC(CCc1ccccc1)N1CCN([C@H]([C@@H](C)c2c[nH]c3ccccc23)C(=O)N[C@H](CCCCN)C(=O)OC(C)(C)C)C1=O
InChI Key InChIKey=ZVXCIRLZARDKCY-LWUGRXNISA-N
Data  1 KI
  Tab Delimited (TSV)   2D SDfile   Computed 3D by Vconf -m prep SDfile
Find this compound or compounds like it in BindingDB:
Activity Spreadsheet -- Enzyme Inhibition Constant Data from BindingDB
Found 1 hit for monomerid = 50075293
TargetSomatostatin receptor type 2(Homo sapiens (Human))
Merck Research Laboratories
Curated by ChEMBL
LigandPNGBDBM50075293((R)-6-Amino-2-{(2R,3S)-3-(1H-indol-3-yl)-2-[3-(1-m...)
Affinity DataKi:  12nM. Assay description: In vitro binding affinity was evaluated against human Somatostatin receptor type 2 (hSSTR-2)
In DepthDetails ArticlePubMed