BDBM50075939 2-Dimethylamino-N-{4-[6-hydroxy-3-(3-methoxy-4-pyrrolidin-1-ylmethyl-benzyl)-benzo[b]thiophen-2-yl]-phenyl}-acetamide::CHEMBL350373
SMILES COc1cc(Cc2c(sc3cc(O)ccc23)-c2ccc(NC(=O)CN(C)C)cc2)ccc1CN1CCCC1
InChI Key InChIKey=GFJWUHJYTGWVPI-UHFFFAOYSA-N
Data  1 KI
  Tab Delimited (TSV)   2D SDfile   Computed 3D by Vconf -m prep SDfile
Find this compound or compounds like it in BindingDB:
Activity Spreadsheet -- Enzyme Inhibition Constant Data from BindingDB
Found 1 hit for monomerid = 50075939
TargetProthrombin(Homo sapiens (Human))
Eli Lilly
Curated by ChEMBL
LigandPNGBDBM50075939(2-Dimethylamino-N-{4-[6-hydroxy-3-(3-methoxy-4-pyr...)
Affinity DataKi:  2.30nM. Assay description: Binding inhibition against thrombin was measured by nonlinear regression analysis using Morrison's equation for tight-binding inhibition
In DepthDetails ArticlePubMed