BDBM50076926 1,11-dihydroxy-5,7-dioxo-6-phenylcarboxamido-12-(3,4,5-trihydroxy-6-hydroxymethyltetrahydro-2H-2-pyranyl)-6,7,12,13-tetrahydro-5H-indolo[2,3-a]pyrrolo[3,4-c]carbazole::CHEMBL277432
SMILES OCC1OC(C(O)C(O)C1O)n1c2c(O)cccc2c2c3C(=O)N(NC(=O)c4ccccc4)C(=O)c3c3c4cccc(O)c4[nH]c3c12
InChI Key InChIKey=RSQRSARUKHGSAH-UHFFFAOYSA-N
Data  2 IC50  1 EC50
  Tab Delimited (TSV)   2D SDfile   Computed 3D by Vconf -m prep SDfile
Find this compound or compounds like it in BindingDB:
Activity Spreadsheet -- Enzyme Inhibition Constant Data from BindingDB
Found 3 hits for monomerid = 50076926
TargetProtein kinase C alpha type(Homo sapiens (Human))
Banyu Tsukuba Research Institute
Curated by ChEMBL
LigandPNGBDBM50076926(1,11-dihydroxy-5,7-dioxo-6-phenylcarboxamido-12-(3...)
Affinity DataIC50:  3.50E+4nM. Assay description: In vitro activity evaluated against protein kinase C (using histone II-As as a substrate)
In DepthDetails ArticlePubMed
TargetDNA topoisomerase 1(Homo sapiens (Human))
Banyu Tsukuba Research Institute
Curated by ChEMBL
LigandPNGBDBM50076926(1,11-dihydroxy-5,7-dioxo-6-phenylcarboxamido-12-(3...)
Affinity DataEC50:  52nM. Assay description: In vitro activity against topoisomerase-I mediated cleavage of supercoiled pBR322 plasmid DNA
In DepthDetails ArticlePubMed
TargetEpidermal growth factor receptor(Homo sapiens (Human))
Banyu Tsukuba Research Institute
Curated by ChEMBL
LigandPNGBDBM50076926(1,11-dihydroxy-5,7-dioxo-6-phenylcarboxamido-12-(3...)
Affinity DataIC50: >2.00E+5nM. Assay description: In vitro activity against Epidermal growth factor receptor (using poly(Glu4Tyr1) as a substrate)
In DepthDetails ArticlePubMed