BDBM50077993 CHEMBL3417379
SMILES CCCC[C@H](NC(=O)[C@@H]1CCCN1C(=O)CNC(=O)[C@H](CCCCN)NC(=O)[C@H](Cc1cnc[nH]1)NC(=O)[C@H](CO)NC(=O)[C@H](CC(C)C)NC(=O)[C@H](CCCNC(N)=N)NC(=O)[C@@H]1CCCN1C(=O)[C@H](CCCNC(N)=N)NC(=O)[C@@H]1CCC(=O)N1)C(=O)N1CCC[C@H]1C(=O)N[C@@H](Cc1ccncc1)C(O)=O
InChI Key
Data  1 KI  1 IC50  2 EC50
  Tab Delimited (TSV)   2D SDfile   Computed 3D by Vconf -m prep SDfile
Find this compound or compounds like it in BindingDB:
Activity Spreadsheet -- Enzyme Inhibition Constant Data from BindingDB
Found 4 hits for monomerid = 50077993
TargetApelin receptor(Homo sapiens (Human))
Universit£
Curated by ChEMBL
LigandPNGBDBM50077993(CHEMBL3417379)
Affinity DataKi:  1nM. Assay description: Displacement of [125I]apelin-13[Glp65,Nle75,Tyr77] from YFP epitope-tagged human APJ receptor expressed in HEK293 cell membranes incubated for 1 hr b...
In DepthDetails ArticlePubMed
TargetApelin receptor(Homo sapiens (Human))
Universit£
Curated by ChEMBL
LigandPNGBDBM50077993(CHEMBL3417379)
Affinity DataIC50:  1.30nM. Assay description: Displacement of [125I]apelin-13[Glp65,Nle75,Tyr77] from YFP epitope-tagged human APJ receptor expressed in HEK293 cell membranes incubated for 1 hr b...
In DepthDetails ArticlePubMed
TargetApelin receptor(Homo sapiens (Human))
Universit£
Curated by ChEMBL
LigandPNGBDBM50077993(CHEMBL3417379)
Affinity DataEC50:  0.730nM. Assay description: Agonist activity at human APJ receptor expressed in HEK293 cells assessed as induction of Galphai1 subunit dissociation incubated for 5 mins by BRET ...
In DepthDetails ArticlePubMed
TargetApelin receptor(Homo sapiens (Human))
Universit£
Curated by ChEMBL
LigandPNGBDBM50077993(CHEMBL3417379)
Affinity DataEC50:  0.450nM. Assay description: Agonist activity at human APJ receptor expressed in HEK293 cells assessed as inhibition of forskolin-induced intracellular cAMP production incubated ...
In DepthDetails ArticlePubMed