BDBM50079712 CHEMBL3414795
SMILES COc1ccc(cc1)-c1cc(NC(=O)N[C@@H](CCC(O)=O)C(O)=O)c(s1)C(O)=O
InChI Key InChIKey=MGGJNGLZBDSWAA-NSHDSACASA-N
Data  1 IC50
  Tab Delimited (TSV)   2D SDfile   Computed 3D by Vconf -m prep SDfile
Find this compound or compounds like it in BindingDB:
Activity Spreadsheet -- Enzyme Inhibition Constant Data from BindingDB
Found 1 hit for monomerid = 50079712
Target3-oxoacyl-ACP synthase(Pseudomonas aeruginosa)
Saarland University & Helmholtz Institute For Pharmaceutical Research Saarland (Hips)
Curated by ChEMBL
LigandPNGBDBM50079712(CHEMBL3414795)
Affinity DataIC50:  3.03E+4nM. Assay description: Inhibition of recombinant His6-tagged Pseudomonas aeruginosa PqsD expressed in Escherichia coli BL21 (deltaDE3) using anthraniloyl-CoA/beta-ketodecan...
In DepthDetails ArticlePubMed