BDBM50080468 CHEMBL3422331
SMILES Cc1cc(C)c(NC(=O)CSc2nnc3c4ccccc4n(CC(O)=O)c3n2)c(C)c1
InChI Key InChIKey=WALRYUOHQYMQNZ-UHFFFAOYSA-N
Data  2 IC50
  Tab Delimited (TSV)   2D SDfile   Computed 3D by Vconf -m prep SDfile
Find this compound or compounds like it in BindingDB:
Activity Spreadsheet -- Enzyme Inhibition Constant Data from BindingDB
Found 2 hits for monomerid = 50080468
TargetAldo-keto reductase family 1 member B1(Rattus norvegicus)
Slovak Academy Of Sciences
Curated by ChEMBL
LigandPNGBDBM50080468(CHEMBL3422331)
Affinity DataIC50:  4.06E+3nM. Assay description: Inhibition of Wistar rat lens aldose reductase using D,L-glyceraldehyde as substrate incubated for 1 min measured for 4 mins by spectrophotometry
In DepthDetails ArticlePubMed
TargetAldo-keto reductase family 1 member B1(Rattus norvegicus)
Slovak Academy Of Sciences
Curated by ChEMBL
LigandPNGBDBM50080468(CHEMBL3422331)
Affinity DataIC50:  4.07E+3nM. Assay description: Inhibition of Wistar rat lens aldose reductase using D,L-glyceraldehyde as substrate incubated for 1 min measured for 4 mins by spectrophotometry
In DepthDetails ArticlePubMed