BDBM50080584 CHEMBL3421641
SMILES OC(=O)c1cc(-c2ccc(CNC(=O)c3ccccc3)cc2)n(n1)-c1ccc(Cl)c(Cl)c1
InChI Key InChIKey=FIJKENBSSMKYJW-UHFFFAOYSA-N
Data  1 Kd
  Tab Delimited (TSV)   2D SDfile   Computed 3D by Vconf -m prep SDfile
Find this compound or compounds like it in BindingDB:
Activity Spreadsheet -- Enzyme Inhibition Constant Data from BindingDB
Found 1 hit for monomerid = 50080584
TargetReplication protein A 70 kDa DNA-binding subunit(Homo sapiens (Human))
Vanderbilt University School Of Medicine
Curated by ChEMBL
LigandPNGBDBM50080584(CHEMBL3421641)
Affinity DataKd:  90nM. Assay description: Binding affinity to RPA70N protein (unknown origin) incubated for 1 hr using FITC-ATRIP/FITC-ATRIP2 peptide probe by fluorescence polarization anisot...
In DepthDetails ArticlePubMed