BDBM50082973 (2R,3S)-N*1*-((S)-2,2-Dimethyl-1-methylcarbamoyl-propyl)-N*4*-hydroxy-2-isobutyl-3-[2-(2-methyl-benzothiazol-5-yl)-ethoxy]-succinamide::CHEMBL147956
SMILES CNC(=O)[C@@H](NC(=O)[C@H](CC(C)C)[C@H](OCCc1ccc2sc(C)nc2c1)C(=O)NO)C(C)(C)C
InChI Key InChIKey=DYPGYXPORHVYHH-JRGCBEDISA-N
Data  2 IC50
  Tab Delimited (TSV)   2D SDfile   Computed 3D by Vconf -m prep SDfile
Find this compound or compounds like it in BindingDB:
Activity Spreadsheet -- Enzyme Inhibition Constant Data from BindingDB
Found 2 hits for monomerid = 50082973
TargetDisintegrin and metalloproteinase domain-containing protein 17(Homo sapiens (Human))
Astrazeneca
Curated by ChEMBL
LigandPNGBDBM50082973((2R,3S)-N*1*-((S)-2,2-Dimethyl-1-methylcarbamoyl-p...)
Affinity DataIC50:  0.210nM. Assay description: Inhibitory activity against Tumor necrosis factor alpha-converting enzyme (TACE) in blood.
In DepthDetails ArticlePubMed
TargetDisintegrin and metalloproteinase domain-containing protein 17(Homo sapiens (Human))
Astrazeneca
Curated by ChEMBL
LigandPNGBDBM50082973((2R,3S)-N*1*-((S)-2,2-Dimethyl-1-methylcarbamoyl-p...)
Affinity DataIC50:  3.50E+3nM. Assay description: Inhibition of TNF(tumor necrosis factor) in human blood
In DepthDetails ArticlePubMed