BDBM50082991 (2R,3S)-N*1*-((S)-2,2-Dimethyl-1-methylcarbamoyl-propyl)-N*4*-hydroxy-2-isobutyl-3-(1-methyl-2-oxo-1,2-dihydro-quinolin-6-ylmethoxy)-succinamide::CHEMBL144611
SMILES CNC(=O)[C@@H](NC(=O)[C@H](CC(C)C)[C@H](OCc1ccc2n(C)c(=O)ccc2c1)C(=O)NO)C(C)(C)C
InChI Key InChIKey=JTCBZWXCQOLSNN-BVYCBKJFSA-N
Data  3 IC50
  Tab Delimited (TSV)   2D SDfile   Computed 3D by Vconf -m prep SDfile
Find this compound or compounds like it in BindingDB:
Activity Spreadsheet -- Enzyme Inhibition Constant Data from BindingDB
Found 3 hits for monomerid = 50082991
TargetDisintegrin and metalloproteinase domain-containing protein 17(Homo sapiens (Human))
Astrazeneca
Curated by ChEMBL
LigandPNGBDBM50082991((2R,3S)-N*1*-((S)-2,2-Dimethyl-1-methylcarbamoyl-p...)
Affinity DataIC50:  1.44E+3nM. Assay description: Inhibition of TNF(tumor necrosis factor) in human blood
In DepthDetails ArticlePubMed
TargetDisintegrin and metalloproteinase domain-containing protein 17(Homo sapiens (Human))
Astrazeneca
Curated by ChEMBL
LigandPNGBDBM50082991((2R,3S)-N*1*-((S)-2,2-Dimethyl-1-methylcarbamoyl-p...)
Affinity DataIC50:  1nM. Assay description: Inhibitory activity against Tumor necrosis factor alpha-converting enzyme (TACE) in blood.
In DepthDetails ArticlePubMed
TargetInterstitial collagenase(Homo sapiens (Human))
Astrazeneca
Curated by ChEMBL
LigandPNGBDBM50082991((2R,3S)-N*1*-((S)-2,2-Dimethyl-1-methylcarbamoyl-p...)
Affinity DataIC50:  0.880nM. Assay description: Inhibitory activity against MMP-1 (Matrix metalloproteinase-1)
In DepthDetails ArticlePubMed