BDBM50082993 (2R,3S)-N*1*-((S)-2,2-Dimethyl-1-methylcarbamoyl-propyl)-N*4*-hydroxy-2-isobutyl-3-(2-methyl-4-oxo-3,4-dihydro-quinazolin-6-ylmethoxy)-succinamide::CHEMBL144229
SMILES CNC(=O)[C@@H](NC(=O)[C@H](CC(C)C)[C@H](OCc1ccc2nc(C)[nH]c(=O)c2c1)C(=O)NO)C(C)(C)C
InChI Key InChIKey=HVHNWBGVXFRQSU-YZGWKJHDSA-N
Data  2 IC50
  Tab Delimited (TSV)   2D SDfile   Computed 3D by Vconf -m prep SDfile
Find this compound or compounds like it in BindingDB:
Activity Spreadsheet -- Enzyme Inhibition Constant Data from BindingDB
Found 2 hits for monomerid = 50082993
TargetDisintegrin and metalloproteinase domain-containing protein 17(Homo sapiens (Human))
Astrazeneca
Curated by ChEMBL
LigandPNGBDBM50082993((2R,3S)-N*1*-((S)-2,2-Dimethyl-1-methylcarbamoyl-p...)
Affinity DataIC50:  0.430nM. Assay description: Inhibitory activity against Tumor necrosis factor alpha-converting enzyme (TACE) in blood.
In DepthDetails ArticlePubMed
TargetDisintegrin and metalloproteinase domain-containing protein 17(Homo sapiens (Human))
Astrazeneca
Curated by ChEMBL
LigandPNGBDBM50082993((2R,3S)-N*1*-((S)-2,2-Dimethyl-1-methylcarbamoyl-p...)
Affinity DataIC50:  2.40E+3nM. Assay description: Inhibition of TNF(tumor necrosis factor) in human blood
In DepthDetails ArticlePubMed