BDBM50086648 phenoxymethylphosphonate
SMILES [O-]P([O-])(=O)COc1ccccc1
InChI Key InChIKey=OXWZBKRJVHTTES-UHFFFAOYSA-L
Data  2 KI
  Tab Delimited (TSV)   2D SDfile   Computed 3D by Vconf -m prep SDfile
Find this compound or compounds like it in BindingDB:
Activity Spreadsheet -- Enzyme Inhibition Constant Data from BindingDB
Found 2 hits for monomerid = 50086648
TargetTyrosine-protein phosphatase non-receptor type 1(Homo sapiens (Human))
New York University
Curated by ChEMBL
LigandPNGBDBM50086648(phenoxymethylphosphonate)
Affinity DataKi:  3.30E+6nM. Assay description: Compound was evaluated for the inhibition constant against Protein-tyrosine phosphatase (PTP1B )
In DepthDetails ArticlePubMed
TargetDual specificity protein phosphatase 3(Homo sapiens (Human))
New York University
Curated by ChEMBL
LigandPNGBDBM50086648(phenoxymethylphosphonate)
Affinity DataKi:  2.60E+7nM. Assay description: Compound was evaluated for the inhibition constant against dual specificity phosphatase VHR
In DepthDetails ArticlePubMed