BDBM50087093 1-{[2-(1-Carboxy-2-phenyl-ethylcarbamoyl)-3-phenyl-propyl]-hydroxy-phosphinoyl}-propyl-ammonium
SMILES CCC([NH3+])P(O)(=O)C[C@@H](Cc1ccccc1)C(=O)N[C@@H](Cc1ccccc1)C(O)=O
InChI Key InChIKey=LFNLOFAQFPNEEA-LFPSWIHMSA-O
Data  2 KI
  Tab Delimited (TSV)   2D SDfile   Computed 3D by Vconf -m prep SDfile
Find this compound or compounds like it in BindingDB:
Activity Spreadsheet -- Enzyme Inhibition Constant Data from BindingDB
Found 2 hits for monomerid = 50087093
TargetAminopeptidase N(Sus scrofa (Pig))
University Of Paris
Curated by ChEMBL
LigandPNGBDBM50087093(1-{[2-(1-Carboxy-2-phenyl-ethylcarbamoyl)-3-phenyl...)
Affinity DataKi:  2.30nM. Assay description: Inhibitory activity on aminopeptidase N (APN) using Ala-pNA as substrate.
In DepthDetails ArticlePubMed
TargetNeprilysin(Oryctolagus cuniculus (rabbit))
University Of Paris
Curated by ChEMBL
LigandPNGBDBM50087093(1-{[2-(1-Carboxy-2-phenyl-ethylcarbamoyl)-3-phenyl...)
Affinity DataKi:  190nM. Assay description: Inhibitory activity on neutral endopeptidase (NEP) using DGNPA as substrate.
In DepthDetails ArticlePubMed