BDBM50088 2-(4-tert-butylbenzyl)-1,2,3,4-benzothiatriazine 1,1-dioxide::2-[(4-tert-butylphenyl)methyl]-1,2,3,4-benzothiatriazine 1,1-dioxide::2-[4-(tert-butyl)benzyl]-1lambda~6~,2,3,4-benzothiatriazine-1,1(2H)-dione::MLS000544980::SMR000126737::cid_3775134
SMILES CC(C)(C)c1ccc(CN2N=Nc3ccccc3S2(=O)=O)cc1
InChI Key InChIKey=LSHDZDBLOAGRBW-UHFFFAOYSA-N
Data  7 IC50
  Tab Delimited (TSV)   2D SDfile   Computed 3D by Vconf -m prep SDfile
Find this compound or compounds like it in BindingDB:
Activity Spreadsheet -- Enzyme Inhibition Constant Data from BindingDB
Found 7 hits for monomerid = 50088
TargetInduced myeloid leukemia cell differentiation protein Mcl-1(Homo sapiens (Human))
Emory University
Curated by PubChem BioAssay
LigandPNGBDBM50088(2-(4-tert-butylbenzyl)-1,2,3,4-benzothiatriazine 1...)
Affinity DataIC50:  2.41E+4nM. Assay description: NIH Molecular Libraries Screening Centers Network [MLSCN] Emory Chemical Biology Discovery Center in MLSCN Assay provider: Nikolovska-Coleska, Univer...
In DepthDetails PCBioAssay
TargetNeutrophil cytosol factor 1 [S99G](Homo sapiens (Human))
Emory University
Curated by PubChem BioAssay
LigandPNGBDBM50088(2-(4-tert-butylbenzyl)-1,2,3,4-benzothiatriazine 1...)
Affinity DataIC50:  5.00E+4nM. Assay description: NIH Molecular Libraries Screening Centers Network [MLSCN] Emory Chemical Biology Discovery Center in MLSCN Assay provider: Susan Smith, Emory Univers...
In DepthDetails PCBioAssay
TargetDNA damage-inducible transcript 3 protein(Mus musculus)
Emory University
Curated by PubChem BioAssay
LigandPNGBDBM50088(2-(4-tert-butylbenzyl)-1,2,3,4-benzothiatriazine 1...)
Affinity DataIC50: >1.00E+4nM. Assay description: NIH Molecular Libraries Screening Centers Network [MLSCN] Emory Chemical Biology Discovery Center in MLSCN Assay provider: Dr. Randal Kaufman, Univer...
In DepthDetails PCBioAssay
TargetDNA damage-inducible transcript 3 protein(Mus musculus)
Emory University
Curated by PubChem BioAssay
LigandPNGBDBM50088(2-(4-tert-butylbenzyl)-1,2,3,4-benzothiatriazine 1...)
Affinity DataIC50: >1.00E+4nM. Assay description: NIH Molecular Libraries Screening Centers Network [MLSCN] Emory Chemical Biology Discovery Center in MLSCN Assay provider: Dr. Randal Kaufman, Univer...
In DepthDetails PCBioAssay
TargetX-box-binding protein 1(Homo sapiens (Human))
Emory University
Curated by PubChem BioAssay
LigandPNGBDBM50088(2-(4-tert-butylbenzyl)-1,2,3,4-benzothiatriazine 1...)
Affinity DataIC50:  6.05E+3nM. Assay description: NIH Molecular Libraries Screening Centers Network [MLSCN] Emory Chemical Biology Discovery Center in MLSCN Assay provider: Dr. Randal Kaufman, Univer...
In DepthDetails PCBioAssay
TargetMitochondrial import inner membrane translocase subunit TIM23(Saccharomyces cerevisiae S288c)
Burnham Center For Chemical Genomics
Curated by PubChem BioAssay
LigandPNGBDBM50088(2-(4-tert-butylbenzyl)-1,2,3,4-benzothiatriazine 1...)
Affinity DataIC50:  5.66E+3nM. Assay description: Data Source: Sanford-Burnham Center for Chemical Genomics (SBCCG) Source Affiliation: Sanford-Burnham Medical Research Institute(SBMRI, San Diego, CA...
In DepthDetails PCBioAssay
TargetMitochondrial import inner membrane translocase subunit TIM10(Saccharomyces cerevisiae S288c)
Burnham Center For Chemical Genomics
Curated by PubChem BioAssay
LigandPNGBDBM50088(2-(4-tert-butylbenzyl)-1,2,3,4-benzothiatriazine 1...)
Affinity DataIC50:  6.10E+3nM. Assay description: Data Source: Sanford-Burnham Center for Chemical Genomics (SBCCG) Source Affiliation: Sanford-Burnham Medical Research Institute(SBMRI, San Diego, CA...
In DepthDetails PCBioAssay