BDBM50089452 CHEMBL3578201
SMILES OC(=O)CC[C@H](NC(=O)N[C@@H](CCCCN(Cc1ccc(Br)cc1)C(=O)c1ccc(nc1)N1CCN(CC1)c1ccc(cc1)N1CCN(CC1)C(=O)c1ccc(C(O)=O)c(c1)-c1c2ccc(O)cc2oc2cc(=O)ccc12)C(O)=O)C(O)=O
InChI Key InChIKey=HNPUHOJFAXMPAU-GTMCEHENSA-N
Data  1 KI
PDB links: 1 PDB ID matches this monomer.
  Tab Delimited (TSV)   2D SDfile   Computed 3D by Vconf -m prep SDfile
Find this compound or compounds like it in BindingDB:
Activity Spreadsheet -- Enzyme Inhibition Constant Data from BindingDB
Found 1 hit for monomerid = 50089452
TargetGlutamate carboxypeptidase 2(Homo sapiens (Human))
Academy Of Sciences Of The Czech Republic
Curated by ChEMBL
LigandPNGBDBM50089452(CHEMBL3578201)
Affinity DataKi:  0.00860nM. Assay description: Inhibition of antiTEV-tagged GCP2 extracellular portion (aa 44-750) (unknown origin) using folyl-di-L-glutamate as substrate by HPLC-based enzymatic ...