BDBM50089703 CHEMBL29507::N-[4-(3-Nitrooxy-propyl)-phenyl]-[1,3,5]triazine-2,4,6-triamine
SMILES Nc1nc(N)nc(Nc2ccc(CCO[N+]([O-])=O)cc2)n1
InChI Key InChIKey=NXTQMUYZSVXXPK-UHFFFAOYSA-N
Data  1 KI
  Tab Delimited (TSV)   2D SDfile   Computed 3D by Vconf -m prep SDfile
Find this compound or compounds like it in BindingDB:
Activity Spreadsheet -- Enzyme Inhibition Constant Data from BindingDB
Found 1 hit for monomerid = 50089703
TargetAdenosine transporter 1(Trypanosoma brucei)
Universit£
Curated by ChEMBL
LigandPNGBDBM50089703(CHEMBL29507 | N-[4-(3-Nitrooxy-propyl)-phenyl]-[1,...)
Affinity DataKi:  200nM. Assay description: Compound was tested for inhibition of Adenosine transporter P2 type by using [2-3H]adenosine as radioligand in Trypanosoma equiperdum
In DepthDetails ArticlePubMed