BDBM50092477 CHEMBL3586178
SMILES Clc1cccc(Nc2ncnc3ccc(NC(=O)[C@@H]4CCCN4C4=NC(=O)\C(S4)=C/c4cccnc4Cl)cc23)c1
InChI Key InChIKey=WLAYFSYGEAPARC-HPARJBSBSA-N
Data  1 IC50
  Tab Delimited (TSV)   2D SDfile   Computed 3D by Vconf -m prep SDfile
Find this compound or compounds like it in BindingDB:
Activity Spreadsheet -- Enzyme Inhibition Constant Data from BindingDB
Found 1 hit for monomerid = 50092477
TargetEpidermal growth factor receptor(Homo sapiens (Human))
Soochow University
Curated by ChEMBL
LigandPNGBDBM50092477(CHEMBL3586178)
Affinity DataIC50:  7.40E+3nM. Assay description: Inhibition of recombinant EGFR (unknown origin) assessed as inhibition of autophosphorylation after 1 hr by DELFIA/Time-resolved fluorometry
In DepthDetails ArticlePubMed