BDBM50093437 CHEMBL3586668
SMILES COc1cc(cnc1OC)N1CCc2nc(NC(C)=O)sc2C1
InChI Key InChIKey=DBZRMTPHOAMTIG-FQXKAQEUSA-N
Data  1 KI
  Tab Delimited (TSV)   2D SDfile   Computed 3D by Vconf -m prep SDfile
Find this compound or compounds like it in BindingDB:
Activity Spreadsheet -- Enzyme Inhibition Constant Data from BindingDB
Found 1 hit for monomerid = 50093437
TargetPhosphatidylinositol 4,5-bisphosphate 3-kinase catalytic subunit gamma isoform(Homo sapiens (Human))
Vertex Pharmaceuticals
Curated by ChEMBL
LigandPNGBDBM50093437(CHEMBL3586668)
Affinity DataKi:  0.0130nM. Assay description: Inhibition of PI3Kgamma (unknown origin) using [33P]ATP and PIP2 incubated for 15 mins by liquid scintillation counting method
In DepthDetails ArticlePubMed