BDBM50095128 (3S,4R)-4-(4-Chloro-phenyl)-1-methyl-piperidine-3-carboxylic acid4-({[(3S,4R)-4-(4-chloro-phenyl)-1-methyl-piperidine-3-carbonyl]-amino}-methyl)-benzylamide::CHEMBL327329
SMILES CN1CC[C@H]([C@@H](C1)C(=O)NCc1ccc(CNC(=O)[C@@H]2CN(C)CC[C@H]2c2ccc(Cl)cc2)cc1)c1ccc(Cl)cc1
InChI Key InChIKey=SEIQXEMHCYOXBR-GASGPIRDSA-N
Data  3 KI
  Tab Delimited (TSV)   2D SDfile   Computed 3D by Vconf -m prep SDfile
Find this compound or compounds like it in BindingDB:
Activity Spreadsheet -- Enzyme Inhibition Constant Data from BindingDB
Found 3 hits for monomerid = 50095128
TargetSodium-dependent serotonin transporter(Rattus norvegicus (rat))
Georgetown University Medical Center
Curated by ChEMBL
LigandPNGBDBM50095128((3S,4R)-4-(4-Chloro-phenyl)-1-methyl-piperidine-3-...)
Affinity DataKi:  0.320nM. Assay description: Inhibition of [3H]-5-HT uptake into rat synaptosomes by Serotonin transporter
In DepthDetails ArticlePubMed
TargetTransporter(Rattus norvegicus)
Georgetown University Medical Center
Curated by ChEMBL
LigandPNGBDBM50095128((3S,4R)-4-(4-Chloro-phenyl)-1-methyl-piperidine-3-...)
Affinity DataKi:  74nM. Assay description: Inhibition of norepinephrine transporter by inhibition of [3H]-NE uptake into rat nerve endings (synaptosomes)
In DepthDetails ArticlePubMed
TargetSodium-dependent dopamine transporter(Rattus norvegicus (rat))
Georgetown University Medical Center
Curated by ChEMBL
LigandPNGBDBM50095128((3S,4R)-4-(4-Chloro-phenyl)-1-methyl-piperidine-3-...)
Affinity DataKi:  2.27E+3nM. Assay description: Inhibition of [3H]-DA uptake at Dopamine transporter into rat nerve endings (synaptosomes)
In DepthDetails ArticlePubMed