BDBM50096597 CHEMBL3350919::NAD+ analogue
SMILES COc1cccc(c1)C(=O)N[C@@H]1[C@H](O)[C@@H](COP(O)(=O)OP([O-])(=O)O[C@H]2O[C@H]([C@H](O)[C@@H]2O)[n+]2cccc(c2)C(N)=O)O[C@H]1n1cnc2c(NCc3cccc4ccccc34)ncnc12
InChI Key InChIKey=YTHNHXPIEXZICS-CWFIGKTDSA-M
Data  4 IC50
  Tab Delimited (TSV)   2D SDfile   Computed 3D by Vconf -m prep SDfile
Find this compound or compounds like it in BindingDB:
Activity Spreadsheet -- Enzyme Inhibition Constant Data from BindingDB
Found 4 hits for monomerid = 50096597
TargetGlyceraldehyde-3-phosphate dehydrogenase(Homo sapiens (Human))
University Of Washington
Curated by ChEMBL
LigandPNGBDBM50096597(CHEMBL3350919 | NAD+ analogue)
Affinity DataIC50:  100nM. Assay description: Inhibitory concentration against Trypanosoma cruzi glyceraldehyde-3-phosphate dehydrogenase (GAPDH)
In DepthDetails ArticlePubMed
TargetGlyceraldehyde-3-phosphate dehydrogenase(Homo sapiens (Human))
University Of Washington
Curated by ChEMBL
LigandPNGBDBM50096597(CHEMBL3350919 | NAD+ analogue)
Affinity DataIC50: >5.00E+5nM. Assay description: Inhibitory concentration against rabbit muscle glyceraldehyde-3-phosphate dehydrogenase (GAPDH)
In DepthDetails ArticlePubMed
TargetGlyceraldehyde-3-phosphate dehydrogenase(Homo sapiens (Human))
University Of Washington
Curated by ChEMBL
LigandPNGBDBM50096597(CHEMBL3350919 | NAD+ analogue)
Affinity DataIC50:  100nM. Assay description: Inhibitory concentration against Trypanosoma brucei glyceraldehyde-3-phosphate dehydrogenase (GAPDH)
In DepthDetails ArticlePubMed
TargetGlyceraldehyde-3-phosphate dehydrogenase(Homo sapiens (Human))
University Of Washington
Curated by ChEMBL
LigandPNGBDBM50096597(CHEMBL3350919 | NAD+ analogue)
Affinity DataIC50:  60nM. Assay description: Inhibitory concentration against rabbit muscle glyceraldehyde-3-phosphate dehydrogenase (GAPDH)
In DepthDetails ArticlePubMed