BDBM50099090 (S)-1-[(2R,3S,4R,5R)-5-(6-Amino-purin-9-yl)-3,4-dihydroxy-tetrahydro-furan-2-ylmethoxycarbonyl]-3-methylsulfanyl-propyl-ammonium
SMILES CSCC[C@H]([NH3+])C(=O)OC[C@H]1O[C@H]([C@H](O)[C@@H]1O)n1cnc2c(N)ncnc12
InChI Key InChIKey=MUIFRRWPJKQRBG-TWBCTODHSA-O
Data  1 IC50
  Tab Delimited (TSV)   2D SDfile   Computed 3D by Vconf -m prep SDfile
Find this compound or compounds like it in BindingDB:
Activity Spreadsheet -- Enzyme Inhibition Constant Data from BindingDB
Found 1 hit for monomerid = 50099090
TargetMethionine--tRNA ligase, cytoplasmic(Homo sapiens (Human))
Seoul National University
Curated by ChEMBL
LigandPNGBDBM50099090((S)-1-[(2R,3S,4R,5R)-5-(6-Amino-purin-9-yl)-3,4-di...)
Affinity DataIC50:  5.00E+3nM. Assay description: Inhibition of [35S]methionyl incorporation by Escherichia coli methionyl-tRNA synthetase (MetRS)
In DepthDetails ArticlePubMed