BDBM50099573 1N-[4-methoxy-3-methylamino(thioxo)methylsulfamoylphenethyl]-5-chloro-2-methoxybenzamide::5-[2-(5-chloro-2-methoxybenzamido)ethyl]-2-methoxy-benzenesulfonyl-3-methlthiourea::CHEMBL12531
SMILES CNC(=S)NS(=O)(=O)c1cc(CCNC(=O)c2cc(Cl)ccc2OC)ccc1OC
InChI Key InChIKey=VXTKXGKPBOLHRY-UHFFFAOYSA-N
Data  2 IC50
  Tab Delimited (TSV)   2D SDfile   Computed 3D by Vconf -m prep SDfile
Find this compound or compounds like it in BindingDB:
Activity Spreadsheet -- Enzyme Inhibition Constant Data from BindingDB
Found 2 hits for monomerid = 50099573
LigandPNGBDBM50099573(1N-[4-methoxy-3-methylamino(thioxo)methylsulfamoyl...)
Affinity DataIC50:  8.20E+3nM. Assay description: Inhibition of human SUR1/Kir6.2 expressed in CHO cells
In DepthDetails ArticlePubMed
LigandPNGBDBM50099573(1N-[4-methoxy-3-methylamino(thioxo)methylsulfamoyl...)
Affinity DataIC50:  4.30E+3nM. Assay description: Inhibition of human SUR2A/Kir6.2 expressed in Xenopus oocytes
In DepthDetails ArticlePubMed