BDBM50099689 4-Amino-phenanthrene-9,10-dione::CHEMBL49236
SMILES Nc1cccc2C(=O)C(=O)c3ccccc3-c12
InChI Key InChIKey=GNQVNMOALCQXTO-UHFFFAOYSA-N
Data  2 IC50
  Tab Delimited (TSV)   2D SDfile   Computed 3D by Vconf -m prep SDfile
Find this compound or compounds like it in BindingDB:
Activity Spreadsheet -- Enzyme Inhibition Constant Data from BindingDB
Found 2 hits for monomerid = 50099689
TargetReceptor-type tyrosine-protein phosphatase C(Homo sapiens (Human))
Astrazeneca Pharmaceuticals
Curated by ChEMBL
LigandPNGBDBM50099689(4-Amino-phenanthrene-9,10-dione | CHEMBL49236)
Affinity DataIC50:  2.90E+3nM. Assay description: Inhibitory concentration against CD45 protein-tyrosine phosphatase using lck-10mer as substrate
In DepthDetails ArticlePubMed
TargetReceptor-type tyrosine-protein phosphatase C(Homo sapiens (Human))
Astrazeneca Pharmaceuticals
Curated by ChEMBL
LigandPNGBDBM50099689(4-Amino-phenanthrene-9,10-dione | CHEMBL49236)
Affinity DataIC50:  800nM. Assay description: In vitro inhibitory activity against the cytosolic portion of CD45 protein-tyrosine phosphatase using pNPP as the substrate
In DepthDetails ArticlePubMed