BDBM50099739 7-(9,10-Dioxo-9,10-dihydro-phenanthren-3-ylcarbamoyl)-heptanoic acid methyl ester::CHEMBL298384
SMILES COC(=O)CCCCCCC(=O)Nc1ccc2C(=O)C(=O)c3ccccc3-c2c1
InChI Key InChIKey=GMLYZTKKVRASPB-UHFFFAOYSA-N
Data  1 IC50
  Tab Delimited (TSV)   2D SDfile   Computed 3D by Vconf -m prep SDfile
Find this compound or compounds like it in BindingDB:
Activity Spreadsheet -- Enzyme Inhibition Constant Data from BindingDB
Found 1 hit for monomerid = 50099739
TargetReceptor-type tyrosine-protein phosphatase C(Homo sapiens (Human))
Astrazeneca Pharmaceuticals
Curated by ChEMBL
LigandPNGBDBM50099739(7-(9,10-Dioxo-9,10-dihydro-phenanthren-3-ylcarbamo...)
Affinity DataIC50:  700nM. Assay description: In vitro inhibitory activity against the cytosolic portion of CD45 protein-tyrosine phosphatase using pNPP as the substrate
In DepthDetails ArticlePubMed