BDBM50099768 4-(2-{2-[1-(Carboxymethyl-carbamoyl)-4-guanidino-butylcarbamoyl]-pyrrolidin-1-yl}-2-oxo-ethylcarbamoyl)-4-[(9,10-dioxo-9,10-dihydro-phenanthrene-2-carbonyl)-amino]-butyric acid::CHEMBL299303
SMILES NC(=N)NCCCC(NC(=O)C1CCCN1C(=O)CNC(=O)C(CCC(O)=O)NC(=O)c1ccc2-c3ccccc3C(=O)C(=O)c2c1)C(=O)NCC(O)=O
InChI Key InChIKey=HMDAXRGMYLGNEH-UHFFFAOYSA-N
Data  1 IC50
  Tab Delimited (TSV)   2D SDfile   Computed 3D by Vconf -m prep SDfile
Find this compound or compounds like it in BindingDB:
Activity Spreadsheet -- Enzyme Inhibition Constant Data from BindingDB
Found 1 hit for monomerid = 50099768
TargetReceptor-type tyrosine-protein phosphatase C(Homo sapiens (Human))
Astrazeneca Pharmaceuticals
Curated by ChEMBL
LigandPNGBDBM50099768(4-(2-{2-[1-(Carboxymethyl-carbamoyl)-4-guanidino-b...)
Affinity DataIC50:  700nM. Assay description: In vitro inhibitory activity against the cytosolic portion of CD45 protein-tyrosine phosphatase using pNPP as the substrate
In DepthDetails ArticlePubMed