BDBM50104756 CHEMBL3594144
SMILES [H][C@@]1(CC[C@@]2(C)C3=C(C(=O)[C@H](OC(C)=O)[C@]12C)[C@@]1(C)CCC(=O)[C@@](C)(CO)[C@]1([H])C[C@@H]3O)[C@H](C)CC\C=C(/C)C(O)=O
InChI Key InChIKey=IFIDRYXKWRSXFG-ZUJCHVHWSA-N
Data  1 IC50
  Tab Delimited (TSV)   2D SDfile   Computed 3D by Vconf -m prep SDfile
Find this compound or compounds like it in BindingDB:
Activity Spreadsheet -- Enzyme Inhibition Constant Data from BindingDB
Found 1 hit for monomerid = 50104756
Target3-hydroxy-3-methylglutaryl-coenzyme A reductase(Sus scrofa)
Chinese Academy Of Sciences
Curated by ChEMBL
LigandPNGBDBM50104756(CHEMBL3594144)
Affinity DataIC50:  2.66E+4nM. Assay description: Inhibition of pig liver microsomes HMG-CoA reductase incubated for 5 mins in using HMG-CoA and NADPH by colorimetric method
In DepthDetails ArticlePubMed