BDBM50104979 2,10-Dioxo-11-(2'-trifluoromethyl-biphenyl-4-ylmethyl)-1-oxa-3,9-diaza-cyclopentadecane-8,12-dicarboxylic acid 12-hydroxyamide 8-methylcarbamoylmethyl-amide::CHEMBL323929
SMILES CNC(=O)CNC(=O)[C@@H]1CCCCNC(=O)OCCC[C@@H]([C@@H](Cc2ccc(cc2)-c2ccccc2C(F)(F)F)C(=O)N1)C(=O)NO
InChI Key InChIKey=FQRGCXYNQQKTLK-ARNLJNQMSA-N
Data  4 KI
  Tab Delimited (TSV)   2D SDfile   Computed 3D by Vconf -m prep SDfile
Find this compound or compounds like it in BindingDB:
Activity Spreadsheet -- Enzyme Inhibition Constant Data from BindingDB
Found 4 hits for monomerid = 50104979
TargetDisintegrin and metalloproteinase domain-containing protein 17(Sus scrofa (pig))
Dupont Pharmaceuticals
Curated by ChEMBL
LigandPNGBDBM50104979(2,10-Dioxo-11-(2'-trifluoromethyl-biphenyl-4-ylmet...)
Affinity DataKi:  3.80nM. Assay description: Inhibition of porcine TNF-alpha converting enzyme(pTACE).
In DepthDetails ArticlePubMed
Target72 kDa type IV collagenase(Homo sapiens (Human))
Dupont Pharmaceuticals
Curated by ChEMBL
LigandPNGBDBM50104979(2,10-Dioxo-11-(2'-trifluoromethyl-biphenyl-4-ylmet...)
Affinity DataKi:  450nM. Assay description: Inhibition of matrix metalloprotease-2
In DepthDetails ArticlePubMed
TargetMatrix metalloproteinase-9(Homo sapiens (Human))
Dupont Pharmaceuticals
Curated by ChEMBL
LigandPNGBDBM50104979(2,10-Dioxo-11-(2'-trifluoromethyl-biphenyl-4-ylmet...)
Affinity DataKi:  1.17E+3nM. Assay description: Inhibition of human matrix metalloprotease-9
In DepthDetails ArticlePubMed
TargetInterstitial collagenase(Homo sapiens (Human))
Dupont Pharmaceuticals
Curated by ChEMBL
LigandPNGBDBM50104979(2,10-Dioxo-11-(2'-trifluoromethyl-biphenyl-4-ylmet...)
Affinity DataKi: >2.00E+3nM. Assay description: Inhibition of matrix metalloprotease-1
In DepthDetails ArticlePubMed