BDBM50106091 (S)-3-Benzo[1,3]dioxol-5-yl-3-((S)-4-methyl-2-{2-[4-(3-o-tolyl-ureido)-phenyl]-acetylamino}-pentanoylamino)-propionic acid::CHEMBL101151
SMILES CC(C)C[C@H](NC(=O)Cc1ccc(NC(=O)Nc2ccccc2C)cc1)C(=O)N[C@@H](CC(O)=O)c1ccc2OCOc2c1
InChI Key InChIKey=YXFDUNGSOONFHY-UIOOFZCWSA-N
Data  1 IC50
  Tab Delimited (TSV)   2D SDfile   Computed 3D by Vconf -m prep SDfile
Find this compound or compounds like it in BindingDB:
Activity Spreadsheet -- Enzyme Inhibition Constant Data from BindingDB
Found 1 hit for monomerid = 50106091
TargetIntegrin alpha-4/beta-1(Homo sapiens (Human))
Novartis Institute For Biomedical Research
Curated by ChEMBL
LigandPNGBDBM50106091((S)-3-Benzo[1,3]dioxol-5-yl-3-((S)-4-methyl-2-{2-[...)
Affinity DataIC50:  3nM. Assay description: In vitro Very late antigen 4 cell adhesion inhibitory activity measured by binding of fluorescently labeled Ramos cells to immobilized VCAM-1.
In DepthDetails ArticlePubMed