BDBM50106098 (R)-3-((S)-4-Methyl-2-{2-[4-(3-o-tolyl-ureido)-phenyl]-acetylamino}-pentanoylamino)-hex-5-enoic acid::CHEMBL318936
SMILES CC(C)C[C@H](NC(=O)Cc1ccc(NC(=O)Nc2ccccc2C)cc1)C(=O)N[C@H](CC=C)CC(O)=O
InChI Key InChIKey=IEFCHTLJLCKGBX-VWNXMTODSA-N
Data  1 IC50
  Tab Delimited (TSV)   2D SDfile   Computed 3D by Vconf -m prep SDfile
Find this compound or compounds like it in BindingDB:
Activity Spreadsheet -- Enzyme Inhibition Constant Data from BindingDB
Found 1 hit for monomerid = 50106098
TargetIntegrin alpha-4/beta-1(Homo sapiens (Human))
Novartis Institute For Biomedical Research
Curated by ChEMBL
LigandPNGBDBM50106098((R)-3-((S)-4-Methyl-2-{2-[4-(3-o-tolyl-ureido)-phe...)
Affinity DataIC50:  17nM. Assay description: In vitro Very late antigen 4 cell adhesion inhibitory activity measured by binding of fluorescently labeled Ramos cells to immobilized VCAM-1.
In DepthDetails ArticlePubMed