BDBM50106099 CHEMBL321739::Lithium; (S)-3-[2-((3-methyl-butyl)-{2-[4-(3-o-tolyl-ureido)-phenyl]-acetyl}-amino)-acetylamino]-3-phenyl-propionate
SMILES CC(C)CCN(CC(=O)N[C@@H](CC([O-])=O)c1ccccc1)C(=O)Cc1ccc(NC(=O)Nc2ccccc2C)cc1
InChI Key InChIKey=MPMCKSNLFRPXSM-NDEPHWFRSA-M
Data  1 IC50
  Tab Delimited (TSV)   2D SDfile   Computed 3D by Vconf -m prep SDfile
Find this compound or compounds like it in BindingDB:
Activity Spreadsheet -- Enzyme Inhibition Constant Data from BindingDB
Found 1 hit for monomerid = 50106099
TargetIntegrin alpha-4/beta-1(Homo sapiens (Human))
Novartis Institute For Biomedical Research
Curated by ChEMBL
LigandPNGBDBM50106099(CHEMBL321739 | Lithium; (S)-3-[2-((3-methyl-butyl)...)
Affinity DataIC50:  29nM. Assay description: In vitro Very late antigen 4 cell adhesion inhibitory activity measured by binding of fluorescently labeled Ramos cells to immobilized VCAM-1.
In DepthDetails ArticlePubMed