BDBM50106102 (E)-(S)-3-[2-((3-Methyl-butyl)-{2-[4-(3-o-tolyl-ureido)-phenyl]-acetyl}-amino)-acetylamino]-hex-4-enoic acid::CHEMBL319296
SMILES C\C=C\[C@H](CC(O)=O)NC(=O)CN(CCC(C)C)C(=O)Cc1ccc(NC(=O)Nc2ccccc2C)cc1
InChI Key InChIKey=IRAMHWQOVZISQX-GGXQVSFTSA-N
Data  1 IC50
  Tab Delimited (TSV)   2D SDfile   Computed 3D by Vconf -m prep SDfile
Find this compound or compounds like it in BindingDB:
Activity Spreadsheet -- Enzyme Inhibition Constant Data from BindingDB
Found 1 hit for monomerid = 50106102
TargetIntegrin alpha-4/beta-1(Homo sapiens (Human))
Novartis Institute For Biomedical Research
Curated by ChEMBL
LigandPNGBDBM50106102((E)-(S)-3-[2-((3-Methyl-butyl)-{2-[4-(3-o-tolyl-ur...)
Affinity DataIC50:  45nM. Assay description: In vitro Very late antigen 4 cell adhesion inhibitory activity measured by binding of fluorescently labeled Ramos cells to immobilized VCAM-1.
In DepthDetails ArticlePubMed