BDBM50108738 1-(4-{4-[2-(2-Hydroxy-ethyl)-pyrimidin-4-yl]-piperazin-1-yl}-pyrimidin-2-yl)-ethanol::CHEMBL149981
SMILES C[C@@H](O)c1nccc(n1)N1CCN(CC1)c1ccnc(CCO)n1
InChI Key InChIKey=LEJUPFRBBLYLKY-GFCCVEGCSA-N
Data  1 IC50
  Tab Delimited (TSV)   2D SDfile   Computed 3D by Vconf -m prep SDfile
Find this compound or compounds like it in BindingDB:
Activity Spreadsheet -- Enzyme Inhibition Constant Data from BindingDB
Found 1 hit for monomerid = 50108738
TargetSorbitol dehydrogenase(Homo sapiens (Human))
Pfizer
Curated by ChEMBL
LigandPNGBDBM50108738(1-(4-{4-[2-(2-Hydroxy-ethyl)-pyrimidin-4-yl]-piper...)
Affinity DataIC50:  40nM. Assay description: Concentration required for 50% in vitro inhibition of recombinant human sorbitol dehydrogenase (h-SDH)
In DepthDetails ArticlePubMed