BDBM50108766 1-[4-(3-Methyl-4-quinoxalin-2-yl-piperazin-1-yl)-pyrimidin-2-yl]-ethanol::CHEMBL149409
SMILES C[C@@H](O)c1nccc(n1)N1CCN([C@@H](C)C1)c1cnc2ccccc2n1
InChI Key InChIKey=NTINFSTYXXIIBQ-UONOGXRCSA-N
Data  1 IC50
  Tab Delimited (TSV)   2D SDfile   Computed 3D by Vconf -m prep SDfile
Find this compound or compounds like it in BindingDB:
Activity Spreadsheet -- Enzyme Inhibition Constant Data from BindingDB
Found 1 hit for monomerid = 50108766
TargetSorbitol dehydrogenase(Homo sapiens (Human))
Pfizer
Curated by ChEMBL
LigandPNGBDBM50108766(1-[4-(3-Methyl-4-quinoxalin-2-yl-piperazin-1-yl)-p...)
Affinity DataIC50:  99nM. Assay description: Concentration required for 50% in vitro inhibition of recombinant human sorbitol dehydrogenase (h-SDH)
In DepthDetails ArticlePubMed