BDBM50109731 CHEMBL3604166
SMILES Nc1c[nH]nc1C(=O)Nc1ccc(F)cc1Cl
InChI Key InChIKey=ZJZWYASZGOPFMY-UHFFFAOYSA-N
Data  2 IC50
  Tab Delimited (TSV)   2D SDfile   Computed 3D by Vconf -m prep SDfile
Find this compound or compounds like it in BindingDB:
Activity Spreadsheet -- Enzyme Inhibition Constant Data from BindingDB
Found 2 hits for monomerid = 50109731
TargetPolyunsaturated fatty acid lipoxygenase ALOX15(Homo sapiens (Human))
Uppsala University
Curated by ChEMBL
LigandPNGBDBM50109731(CHEMBL3604166)
Affinity DataIC50:  69nM. Assay description: Inhibition of 15-LOX-1 in human L1236 cells assessed as reduction in conversion of arachidonic acid to 15-HETE pre-incubated 5 min before arachidonic...
In DepthDetails ArticlePubMed
TargetPolyunsaturated fatty acid lipoxygenase ALOX15(Homo sapiens (Human))
Uppsala University
Curated by ChEMBL
LigandPNGBDBM50109731(CHEMBL3604166)
Affinity DataIC50:  641nM. Assay description: Inhibition of human 15-LOX-1 expressed in Sf9 cells assessed as reduction in conversion of arachidonic acid to 15-HETE pre-incubated 5 min before ara...
In DepthDetails ArticlePubMed