BDBM50110501 3-Fluoro-5-(2,4,4-trimethyl-1,4-dihydro-2H-benzo[d][1,3]oxazin-6-yl)-benzonitrile::CHEMBL164695
SMILES CC1Nc2ccc(cc2C(C)(C)O1)-c1cc(F)cc(c1)C#N
InChI Key InChIKey=INMUMXWXTDTJDF-UHFFFAOYSA-N
Data  1 IC50  1 EC50
  Tab Delimited (TSV)   2D SDfile   Computed 3D by Vconf -m prep SDfile
Find this compound or compounds like it in BindingDB:
Activity Spreadsheet -- Enzyme Inhibition Constant Data from BindingDB
Found 2 hits for monomerid = 50110501
TargetProgesterone receptor(Homo sapiens (Human))
Wyeth Research
Curated by ChEMBL
LigandPNGBDBM50110501(3-Fluoro-5-(2,4,4-trimethyl-1,4-dihydro-2H-benzo[d...)
Affinity DataEC50:  0.350nM. Assay description: Agonist activity against Progesterone receptor (PR) in transcriptional activation assay in human T47D breast carcinoma cell line
In DepthDetails ArticlePubMed
TargetProgesterone receptor(Homo sapiens (Human))
Wyeth Research
Curated by ChEMBL
LigandPNGBDBM50110501(3-Fluoro-5-(2,4,4-trimethyl-1,4-dihydro-2H-benzo[d...)
Affinity DataIC50:  7.30nM. Assay description: Binding affinity against progesterone receptor using human T47D breast carcinoma cell line
In DepthDetails ArticlePubMed