BDBM50113234 3-Methyl-1-(3-phenyl-propyl)-3,7-dihydro-purine-2,6-dione::CHEMBL67313
SMILES Cn1c2nc[nH]c2c(=O)n(CCCc2ccccc2)c1=O
InChI Key InChIKey=OQPVMZLXRVLYHM-UHFFFAOYSA-N
Data  4 KI
  Tab Delimited (TSV)   2D SDfile   Computed 3D by Vconf -m prep SDfile
Find this compound or compounds like it in BindingDB:
Activity Spreadsheet -- Enzyme Inhibition Constant Data from BindingDB
Found 4 hits for monomerid = 50113234
TargetAdenosine receptor A2b(Homo sapiens (Human))
National Institute Of Diabetes & Digestive & Kidney Diseases
Curated by ChEMBL
LigandPNGBDBM50113234(3-Methyl-1-(3-phenyl-propyl)-3,7-dihydro-purine-2,...)
Affinity DataKi:  2.33E+3nM. Assay description: Binding affinity at human Adenosine A2B receptor expressed in HEK-293 cells, using [125I]-ABOPX as radioligand
In DepthDetails ArticlePubMed
TargetAdenosine receptor A3(Homo sapiens (Human))
National Institute Of Diabetes & Digestive & Kidney Diseases
Curated by ChEMBL
LigandPNGBDBM50113234(3-Methyl-1-(3-phenyl-propyl)-3,7-dihydro-purine-2,...)
Affinity DataKi:  8.65E+3nM. Assay description: Inhibition of [125I]-I-AB-MECA binding to human Adenosine A3 receptor
In DepthDetails ArticlePubMed
TargetAdenosine receptor A2b(Rattus norvegicus)
National Institute Of Diabetes & Digestive & Kidney Diseases
Curated by ChEMBL
LigandPNGBDBM50113234(3-Methyl-1-(3-phenyl-propyl)-3,7-dihydro-purine-2,...)
Affinity DataKi:  1.53E+4nM. Assay description: Inhibition of [125I]-APOBX binding to rat Adenosine A2B receptor expressed in HEK cells
In DepthDetails ArticlePubMed
TargetAdenosine receptor A1(Rattus norvegicus (rat))
National Institute Of Diabetes & Digestive & Kidney Diseases
Curated by ChEMBL
LigandPNGBDBM50113234(3-Methyl-1-(3-phenyl-propyl)-3,7-dihydro-purine-2,...)
Affinity DataKi:  2.44E+4nM. Assay description: Binding affinity of specific [3H]-R-PIA binding to rat Adenosine A1 receptor in HEK-293 cells
In DepthDetails ArticlePubMed